Target
Sodium-dependent dopamine transporter
Ligand
BDBM50327120
Substrate
Meas. Tech.
ChEMBL_663804 (CHEMBL1250704)
IC50
240±n/a nM
Citation
 Misra, MShi, QYe, XGruszecka-Kowalik, EBu, WLiu, ZSchweri, MMDeutsch, HMVenanzi, CA Quantitative structure-activity relationship studies of threo-methylphenidate analogs. Bioorg Med Chem 18:7221-38 (2010)  
Target
Name:
Sodium-dependent dopamine transporter
Synonyms:
DA transporter SC6A3_RAT Sodium-dependent dopamine transporter | Sodium-dependent dopamine transporter (DAT)
Type:
Multi-pass membrane protein
Mol. Mass.:
68749.45
Organism:
Rattus norvegicus (rat)
Description:
P23977
Residue:
619
  
Inhibitor
Name:
BDBM50327120
Synonyms:
(+/-)-threo-N-(2-Chlorobenzyl)methylphenidate | CHEMBL1253919
Type:
Small organic molecule
Emp. Form.:
C21H24ClNO2
Mol. Mass.:
357.874
SMILES:
COC(=O)[C@@H]([C@H]1CCCCN1Cc1ccccc1Cl)c1ccccc1
: