Target
G-protein coupled bile acid receptor 1
Ligand
BDBM50327527
Substrate
Meas. Tech.
ChEMBL_664649 (CHEMBL1260363)
IC50
3700±n/a nM
Citation
 Herbert, MRSiegel, DLStaszewski, LCayanan, CBanerjee, UDhamija, SAnderson, JFan, AWang, LRix, PShiau, AKRao, TSNoble, SAHeyman, RABischoff, EGuha, MKabakibi, APinkerton, AB Synthesis and SAR of 2-aryl-3-aminomethylquinolines as agonists of the bile acid receptor TGR5. Bioorg Med Chem Lett 20:5718-21 (2010)  
Target
Name:
G-protein coupled bile acid receptor 1
Synonyms:
GPBAR_MOUSE M-BAR Tgr5
Type:
PROTEIN
Mol. Mass.:
35665.78
Organism:
Mus musculus
Description:
ChEMBL_1475560
Residue:
329
  
Inhibitor
Name:
BDBM50327527
Synonyms:
2-(4-bromophenyl)-N-((7-methoxy-2-(pyridin-4-yl)quinolin-3-yl)methyl)ethanamine | CHEMBL1258758
Type:
Small organic molecule
Emp. Form.:
C24H22BrN3O
Mol. Mass.:
448.355
SMILES:
COc1ccc2cc(CNCCc3ccc(Br)cc3)c(nc2c1)-c1ccncc1
: