Target
Cathepsin B
Ligand
BDBM50330033
Substrate
Meas. Tech.
ChEMBL_676070 (CHEMBL1273064)
IC50
>10000±n/a nM
Citation
 Kumar, GDChavarria, GECharlton-Sevcik, AKYoo, GKSong, JStrecker, TESiim, BGChaplin, DJTrawick, MLPinney, KG Functionalized benzophenone, thiophene, pyridine, and fluorene thiosemicarbazone derivatives as inhibitors of cathepsin L. Bioorg Med Chem Lett 20:6610-5 (2010)  
Target
Name:
Cathepsin B
Synonyms:
APP secretase CATB_HUMAN CTSB Cathepsin B light chain | Cathepsin B1
Type:
Enzyme
Mol. Mass.:
37819.69
Organism:
Homo sapiens (Human)
Description:
gi_63102437
Residue:
339
  
Inhibitor
Name:
BDBM50330033
Synonyms:
CHEMBL1272310 | [[3-(t-Butyldimethylsilyl)oxyphenyl]-(3-bromophenyl)-ketone]thiosemicarbazone
Type:
Small organic molecule
Emp. Form.:
C20H26BrN3OSSi
Mol. Mass.:
464.494
SMILES:
CC(C)(C)[Si](C)(C)Oc1cccc(c1)C(=NNC(N)=S)c1cccc(Br)c1
: