Target
Procathepsin L
Ligand
BDBM50330034
Substrate
Meas. Tech.
ChEMBL_676069 (CHEMBL1273063)
IC50
126.1±n/a nM
Citation
 Kumar, GDChavarria, GECharlton-Sevcik, AKYoo, GKSong, JStrecker, TESiim, BGChaplin, DJTrawick, MLPinney, KG Functionalized benzophenone, thiophene, pyridine, and fluorene thiosemicarbazone derivatives as inhibitors of cathepsin L. Bioorg Med Chem Lett 20:6610-5 (2010)  
Target
Name:
Procathepsin L
Synonyms:
CATL1_HUMAN CTSL CTSL1 Cathepsin L Cathepsin L1 heavy chain MEP cathepsin L preproprotein
Type:
Enzyme
Mol. Mass.:
37557.19
Organism:
Homo sapiens (Human)
Description:
Purchased from Calbiochem (San Diego, CA).
Residue:
333
  
Inhibitor
Name:
BDBM50330034
Synonyms:
Bis(3-bromophenyl)(4-hydroxy)thiosemicarbazone | CHEMBL1272311
Type:
Small organic molecule
Emp. Form.:
C14H11Br2N3OS
Mol. Mass.:
429.13
SMILES:
NC(=S)NN=C(c1cccc(Br)c1)c1ccc(O)c(Br)c1
: