Target
Cathepsin B
Ligand
BDBM50330048
Substrate
Meas. Tech.
ChEMBL_676070 (CHEMBL1273064)
IC50
>10000±n/a nM
Citation
 Kumar, GDChavarria, GECharlton-Sevcik, AKYoo, GKSong, JStrecker, TESiim, BGChaplin, DJTrawick, MLPinney, KG Functionalized benzophenone, thiophene, pyridine, and fluorene thiosemicarbazone derivatives as inhibitors of cathepsin L. Bioorg Med Chem Lett 20:6610-5 (2010)  
Target
Name:
Cathepsin B
Synonyms:
APP secretase CATB_HUMAN CTSB Cathepsin B light chain | Cathepsin B1
Type:
Enzyme
Mol. Mass.:
37819.69
Organism:
Homo sapiens (Human)
Description:
gi_63102437
Residue:
339
  
Inhibitor
Name:
BDBM50330048
Synonyms:
CHEMBL1269734 | [(3-Bromophenyl)-cyclohexylketone]thiosemicarbazone
Type:
Small organic molecule
Emp. Form.:
C14H18BrN3S
Mol. Mass.:
340.282
SMILES:
NC(=S)NN=C(C1CCCCC1)c1cccc(Br)c1
: