Target
Histamine H3 receptor
Ligand
BDBM84745
Substrate
Meas. Tech.
ChEMBL_685426 (CHEMBL1285325)
Ki
>5000±n/a nM
Citation
 Altenbach, RJBlack, LAStrakhova, MIManelli, AMCarr, TLMarsh, KCWetter, JMWensink, EJHsieh, GCHonore, PGarrison, TRBrioni, JDCowart, MD Diaryldiamines with dual inhibition of the histamine H(3) receptor and the norepinephrine transporter and the efficacy of 4-(3-(methylamino)-1-phenylpropyl)-6-(2-(pyrrolidin-1-yl)ethoxy)naphthalen-1-ol in pain. J Med Chem 53:7869-73 (2010)  
Target
Name:
Histamine H3 receptor
Synonyms:
G-protein coupled receptor 97 HH3R HRH3 Histamine H3 receptor (H3) Histamine receptor (H3 and H4)
Type:
G Protein-Coupled Receptor (GPCR)
Mol. Mass.:
48691.47
Organism:
Homo sapiens (Human)
Description:
Binding assays were using CHO cells stably expressing hH3R receptors.
Residue:
445
  
Inhibitor
Name:
BDBM84745
Synonyms:
CAS_136434-34-9 LY-248686 USRE49340, Rank 5
Type:
Small organic molecule
Emp. Form.:
C18H19NOS
Mol. Mass.:
297.415
SMILES:
CNCC[C@H](Oc1cccc2ccccc12)c1cccs1
: