Target
Sodium-dependent noradrenaline transporter
Ligand
BDBM35229
Substrate
Meas. Tech.
ChEMBL_685427 (CHEMBL1285326)
Kd
0.83±n/a nM
Citation
 Altenbach, RJBlack, LAStrakhova, MIManelli, AMCarr, TLMarsh, KCWetter, JMWensink, EJHsieh, GCHonore, PGarrison, TRBrioni, JDCowart, MD Diaryldiamines with dual inhibition of the histamine H(3) receptor and the norepinephrine transporter and the efficacy of 4-(3-(methylamino)-1-phenylpropyl)-6-(2-(pyrrolidin-1-yl)ethoxy)naphthalen-1-ol in pain. J Med Chem 53:7869-73 (2010)  
Target
Name:
Sodium-dependent noradrenaline transporter
Synonyms:
Monoamine transporter NET Noradrenaline Transporter (NET) Norepinephrine transporter protein (NET) SLC6A2 Sodium-dependent noradrenaline transporter (NET) | Solute carrier family 6 member 2
Type:
Multi-pass membrane protein
Mol. Mass.:
69337.72
Organism:
Homo sapiens (Human)
Description:
P23975
Residue:
617
  
Inhibitor
Name:
BDBM35229
Synonyms:
3-(10,11-dihydro-5H-dibenzo[b,f]azepin-5-yl)-N-methylpropan-1-amine CHEMBL72 DMI Desipramine N-(3-methylaminopropyl)iminobibenzyl demethylimipramine norimipramine
Type:
Small organic molecule
Emp. Form.:
C18H22N2
Mol. Mass.:
266.3807
SMILES:
CNCCCN1c2ccccc2CCc2ccccc12
: