Target
Phospholipid-transporting ATPase ABCA1
Ligand
BDBM50332691
Substrate
Meas. Tech.
ChEMBL_697968 (CHEMBL1633028)
EC50
700±n/a nM
Citation
 Carballo-Jane, EChen, ZO'Neill, EWang, JBurton, CChang, CHChen, XEveland, SFrantz-Wattley, BGagen, KHubbard, BIchetovkin, MLuell, SMeurer, RSong, XStrack, ALangella, ACianetti, SRech, FCapitò, EBufali, SVeneziano, MVerdirame, MBonelli, FMonteagudo, EPessi, AIngenito, RBianchi, E ApoA-I mimetic peptides promote pre-ß HDL formation in vivo causing remodeling of HDL and triglyceride accumulation at higher dose. Bioorg Med Chem 18:8669-78 (2010)  
Target
Name:
Phospholipid-transporting ATPase ABCA1
Synonyms:
ABC-1 ATP-binding cassette 1 ATP-binding cassette transporter 1 Abca1
Type:
PROTEIN
Mol. Mass.:
253915.95
Organism:
Mus musculus
Description:
ChEMBL_697968
Residue:
2261
  
Inhibitor
Name:
BDBM50332691
Synonyms:
CHEMBL1630192
Type:
Small organic molecule
Emp. Form.:
C127H214N32O35
Mol. Mass.:
2749.2515
SMILES:
[#6]-[#6](-[#6])-[#6]-[#6@H](-[#7]-[#6](=O)-[#6@H](-[#6])-[#7]-[#6](=O)-[#6@H](-[#6]-[#6]-[#6](-[#8])=O)-[#7]-[#6](=O)-[#6@H](-[#6]-[#6](-[#6])-[#6])-[#7]-[#6](=O)-[#6@H](-[#6]-[#6]-[#6]-[#6]-[#6]-[#6]-[#6]=[#6])-[#7]-[#6](=O)-[#6@H](-[#6]-[#6]-[#6](-[#8])=O)-[#7]-[#6](=O)-[#6@H](-[#6]-[#6](-[#7])=O)-[#7]-[#6](=O)-[#6@H](-[#6]-[#6](-[#6])-[#6])-[#7]-[#6](=O)-[#6@H](-[#6]-[#6]-[#6]-[#6]-[#7])-[#7]-[#6](=O)-[#6@H](-[#6]-[#6]-[#6](-[#8])=O)-[#7]-[#6](=O)-[#6@H](-[#6]-[#6]-[#6]\[#7]=[#6](/[#7])-[#7])-[#7]-[#6](=O)-[#6@H](-[#6]-c1ccccc1)-[#7]-[#6](=O)-[#6@H](-[#6]-[#6]-[#6](-[#8])=O)-[#7]-[#6](=O)-[#6@H](-[#6]-[#6](-[#8])=O)-[#7]-[#6](=O)-[#6@H](-[#6]-[#6](-[#6])-[#6])-[#7]-[#6](=O)-[#6@@H](-[#7]-[#6](=O)-[#6@@H]-1-[#6]-[#6]-[#6]-[#7]-1-[#6](-[#6])=O)-[#6](-[#6])-[#6])-[#6](=O)-[#7]-[#6@@H](-[#6]-[#6]-[#6]-[#6]-[#7])-[#6](=O)-[#7]-[#6@@H](-[#6]-[#6]-[#6](-[#7])=O)-[#6](=O)-[#7]-[#6@@H](-[#6]-[#6]-[#6]-[#6]-[#7])-[#6](=O)-[#7]-[#6@@H](-[#6]-[#6](-[#6])-[#6])-[#6](=O)-[#7]-[#6@@H](-[#6]-[#6]-[#6]-[#6]-[#7])-[#6](-[#7])=O
: