Target
Xanthine dehydrogenase/oxidase
Ligand
BDBM50333146
Substrate
Meas. Tech.
ChEMBL_701314 (CHEMBL1648934)
IC50
1760±n/a nM
Citation
 Sathisha, KRKhanum, SAChandra, JNAyisha, FBalaji, SMarathe, GKGopal, SRangappa, KS Synthesis and xanthine oxidase inhibitory activity of 7-methyl-2-(phenoxymethyl)-5H-[1,3,4]thiadiazolo[3,2-a]pyrimidin-5-one derivatives. Bioorg Med Chem 19:211-20 (2011)  
Target
Name:
Xanthine dehydrogenase/oxidase
Synonyms:
XD XO Xanthine oxidase Xdh
Type:
PROTEIN
Mol. Mass.:
146252.77
Organism:
Rattus norvegicus
Description:
ChEMBL_1296864
Residue:
1331
  
Inhibitor
Name:
BDBM50333146
Synonyms:
2-((2,4-dimethylphenoxy)methyl)-7-methyl-5H-[1,3,4]thiadiazolo[3,2-a]pyrimidin-5-one | CHEMBL1644712
Type:
Small organic molecule
Emp. Form.:
C15H15N3O2S
Mol. Mass.:
301.364
SMILES:
Cc1ccc(OCc2nn3c(nc(C)cc3=O)s2)c(C)c1
: