Target
Sodium-dependent noradrenaline transporter
Ligand
BDBM50333448
Substrate
Meas. Tech.
ChEMBL_698920 (CHEMBL1645860)
EC50
97±n/a nM
Citation
 Pettersson, MCampbell, BMDounay, ABGray, DLXie, LO'Donnell, CJStratman, NCZoski, KDrummond, EBora, GProbert, AWhisman, T Design, synthesis, and pharmacological evaluation of azetedine and pyrrolidine derivatives as dual norepinephrine reuptake inhibitors and 5-HT(1A) partial agonists. Bioorg Med Chem Lett 21:865-8 (2011)  
Target
Name:
Sodium-dependent noradrenaline transporter
Synonyms:
Monoamine transporter NET Noradrenaline Transporter (NET) Norepinephrine transporter protein (NET) SLC6A2 Sodium-dependent noradrenaline transporter (NET) | Solute carrier family 6 member 2
Type:
Multi-pass membrane protein
Mol. Mass.:
69337.72
Organism:
Homo sapiens (Human)
Description:
P23975
Residue:
617
  
Inhibitor
Name:
BDBM50333448
Synonyms:
3-(2-(2-chloro-6-fluorophenoxy)-6-fluorophenoxy)pyrrolidine | CHEMBL1645615
Type:
Small organic molecule
Emp. Form.:
C16H14ClF2NO2
Mol. Mass.:
325.738
SMILES:
Fc1cccc(Oc2c(F)cccc2Cl)c1OC1CCNC1
: