Target
Beta-galactosidase
Ligand
BDBM50335395
Substrate
Meas. Tech.
ChEMBL_701784 (CHEMBL1656921)
IC50
200000±n/a nM
Citation
 Ghisaidoobe, ABikker, Pde Bruijn, ACGodschalk, FDRogaar, EGuijt, MCHagens, PHalma, JMHart, SMLuitjens, SBvan Rixel, VHWijzenbroek, MZweegers, TDonker-Koopman, WEStrijland, ABoot, RMarel, GvOverkleeft, HSAerts, JM Identification of Potent and Selective Glucosylceramide Synthase Inhibitors from a Library of N-Alkylated Iminosugars ACS Med Chem Lett 2:119-123 (2011)  
Target
Name:
Beta-galactosidase
Synonyms:
Acid beta-galactosidase Bgl Glb1 | Lactase
Type:
PROTEIN
Mol. Mass.:
73125.63
Organism:
Mus musculus
Description:
ChEMBL_701784
Residue:
647
  
Inhibitor
Name:
BDBM50335395
Synonyms:
CHEMBL1651555 | N-Heptyl-L-ido-1-deoxynojirimycin
Type:
Small organic molecule
Emp. Form.:
C13H27NO4
Mol. Mass.:
261.3578
SMILES:
CCCCCCCN1C[C@H](O)[C@@H](O)[C@H](O)[C@@H]1CO
: