Target
C-X-C chemokine receptor type 4
Ligand
BDBM50335557
Substrate
Meas. Tech.
ChEMBL_708476 (CHEMBL1666142)
IC50
0.61±n/a nM
Citation
 Murakami, TKumakura, SYamazaki, TTanaka, RHamatake, MOkuma, KHuang, WToma, JKomano, JYanaka, MTanaka, YYamamoto, N The novel CXCR4 antagonist KRH-3955 is an orally bioavailable and extremely potent inhibitor of human immunodeficiency virus type 1 infection: comparative studies with AMD3100. Antimicrob Agents Chemother 53:2940-8 (2009)  
Target
Name:
C-X-C chemokine receptor type 4
Synonyms:
C-X-C chemokine receptor type 4 CD_antigen=CD184 CXCR-4 CXCR4_HUMAN Fusin LCR1 Leukocyte-derived seven transmembrane domain receptor SDF-1 receptor | Stromal cell-derived factor 1 receptor
Type:
Enzyme
Mol. Mass.:
39754.61
Organism:
Homo sapiens (Human)
Description:
P61073
Residue:
352
  
Inhibitor
Name:
BDBM50335557
Synonyms:
CHEMBL1652605 | N,N-dipropyl-N'-[4-({[(1H-imidazol-2-yl)methyl][(1-methyl-1H-imidazol-2-yl)methyl]amino}methyl)benzyl]-N'-methylbutane-1,4-diamine tri-(2R,3R)-tartrate
Type:
Small organic molecule
Emp. Form.:
C28H45N7
Mol. Mass.:
479.7038
SMILES:
CCCN(CCC)CCCCN(C)Cc1ccc(CN(Cc2ncc[nH]2)Cc2nccn2C)cc1
: