Target
Signal transducer and activator of transcription 3
Ligand
BDBM50337207
Substrate
Meas. Tech.
ChEMBL_726326 (CHEMBL1687314)
Ki
15000±n/a nM
Citation
 Shahani, VMYue, PFletcher, SSharmeen, SSukhai, MALuu, DPZhang, XSun, HZhao, WSchimmer, ADTurkson, JGunning, PT Design, synthesis, and in vitro characterization of novel hybrid peptidomimetic inhibitors of STAT3 protein. Bioorg Med Chem 19:1823-38 (2011)  
Target
Name:
Signal transducer and activator of transcription 3
Synonyms:
Acute-phase response factor STAT3 alpha Signal transducer and activator of transcription 3 Transcription Factor STAT3
Type:
Cytosolic Transcription Factor
Mol. Mass.:
88050.28
Organism:
Mus musculus (mouse)
Description:
Bacterially expressed protein was used in the FP assay.
Residue:
770
  
Inhibitor
Name:
BDBM50337207
Synonyms:
4-((S)-3-(((S)-1-((6-(Benzylcarbamoyl)-3'-carbamoyl-[1,1'-biphenyl]-3-yl)amino)-4-methyl-1-oxopentan-2-yl)-amino)-2-(4-cyanobenzamido)-3-oxopropyl)phenyl dihydrogen phosphate | CHEMBL1684877
Type:
Small organic molecule
Emp. Form.:
C44H43N6O9P
Mol. Mass.:
830.8208
SMILES:
CC(C)C[C@H](NC(=O)[C@H](Cc1ccc(OP(O)(O)=O)cc1)NC(=O)c1ccc(cc1)C#N)C(=O)Nc1ccc(C(=O)NCc2ccccc2)c(c1)-c1cccc(c1)C(N)=O
: