Target
Diacylglycerol O-acyltransferase 1
Ligand
BDBM50341776
Substrate
Meas. Tech.
ChEMBL_743545 (CHEMBL1767986)
EC50
362±n/a nM
Citation
 Qian, YWertheimer, SJAhmad, MCheung, AWFirooznia, FHamilton, MMHayden, SLi, SMarcopulos, NMcDermott, LTan, JYun, WGuo, LPamidimukkala, AChen, YHuang, KSRamsey, GBWhittard, TConde-Knape, KTaub, RRondinone, CMTilley, JBolin, D Discovery of orally active carboxylic acid derivatives of 2-phenyl-5-trifluoromethyloxazole-4-carboxamide as potent diacylglycerol acyltransferase-1 inhibitors for the potential treatment of obesity and diabetes. J Med Chem 54:2433-46 (2011)  
Target
Name:
Diacylglycerol O-acyltransferase 1
Synonyms:
ACAT-related gene product 1 Acyl coA-diacylglycerol acyl transferase 1 (DGAT1) DGAT1 Diacylglycerol Acyltransferase (DGAT1) Diacylglycerol O-acyltransferase 1 (DGAT1) | Diglyceride acyltransferase
Type:
Protein
Mol. Mass.:
55297.82
Organism:
Homo sapiens (Human)
Description:
O75907
Residue:
488
  
Inhibitor
Name:
BDBM50341776
Synonyms:
CHEMBL1766805 | N-(4-(1-(cyclopropanecarbonyl)piperidin-4-yl)phenyl)-2-phenyl-5-(trifluoromethyl)oxazole-4-carboxamide
Type:
Small organic molecule
Emp. Form.:
C26H24F3N3O3
Mol. Mass.:
483.4823
SMILES:
FC(F)(F)c1oc(nc1C(=O)Nc1ccc(cc1)C1CCN(CC1)C(=O)C1CC1)-c1ccccc1
: