Target
Leukotriene A-4 hydrolase
Ligand
BDBM50285634
Substrate
Meas. Tech.
ChEMBL_744414 (CHEMBL1772368)
IC50
1800±n/a nM
Citation
 Thangapandian, SJohn, SSakkiah, SLee, KW Pharmacophore-based virtual screening and Bayesian model for the identification of potential human leukotriene A4 hydrolase inhibitors. Eur J Med Chem 46:1593-603 (2011)  
Target
Name:
Leukotriene A-4 hydrolase
Synonyms:
LKHA4_HUMAN LTA4 Leukotriene A(4) hydrolase Leukotriene A4 hydrolase
Type:
Hydrolase; metalloprotease
Mol. Mass.:
69280.41
Organism:
Homo sapiens (Human)
Description:
Human recombinant LTA4H.
Residue:
611
  
Inhibitor
Name:
BDBM50285634
Synonyms:
(R)-1-((R)-2-Benzyl-3-hydroxycarbamoyl-propionyl)-piperidine-2-carboxylic acid | CHEMBL85542
Type:
Small organic molecule
Emp. Form.:
C17H22N2O5
Mol. Mass.:
334.367
SMILES:
ONC(=O)C[C@@H](Cc1ccccc1)C(=O)N1CCCC[C@@H]1C(O)=O
: