Target
TGF-beta receptor type-1
Ligand
BDBM50351815
Substrate
Meas. Tech.
ChEMBL_765279 (CHEMBL1827918)
IC50
>1000±n/a nM
Citation
 Jin, CHSreenu, DKrishnaiah, MSubrahmanyam, VBRao, KSNagendra Mohan, AVPark, CYSon, JYSon, DHPark, HJSheen, YYKim, DK Synthesis and biological evaluation of 1-substituted-3(5)-(6-methylpyridin-2-yl)-4-(quinoxalin-6-yl)pyrazoles as transforming growth factor-ß type 1 receptor kinase inhibitors. Eur J Med Chem 46:3917-25 (2011)  
Target
Name:
TGF-beta receptor type-1
Synonyms:
ALK-5 Activin A receptor type II-like protein kinase of 53kD SKR4 TGF-beta receptor type I TGFBR1 TGFR1_HUMAN Transforming growth factor-beta receptor type I
Type:
enzyme
Mol. Mass.:
55968.24
Organism:
Homo sapiens (Human)
Description:
P36897
Residue:
503
  
Inhibitor
Name:
BDBM50351815
Synonyms:
CHEMBL1824435
Type:
Small organic molecule
Emp. Form.:
C27H24N6O
Mol. Mass.:
448.5191
SMILES:
Cc1cccc(n1)-c1c(cnn1CC(=O)Nc1ccccc1)-c1ccc2nc(C)c(C)nc2c1
: