Target
Aurora kinase B
Ligand
BDBM50352308
Substrate
Meas. Tech.
ChEMBL_766655 (CHEMBL1827221)
IC50
91±n/a nM
Citation
 Abraham, SHadd, MJTran, LVickers, TSindac, JMilanov, ZVHolladay, MWBhagwat, SSHua, HFord Pulido, JMCramer, MDGitnick, DJames, JDao, ABelli, BArmstrong, RCTreiber, DKLiu, G Novel series of pyrrolotriazine analogs as highly potent pan-Aurora kinase inhibitors. Bioorg Med Chem Lett 21:5296-300 (2011)  
Target
Name:
Aurora kinase B
Synonyms:
AIK2 AIM1 ARK2 AURKB_HUMAN Aurora B-INCENP Aurora kinase B (AURKB) STK-1 STK12 Serine/threonine-protein kinase aurora B
Type:
Protein
Mol. Mass.:
39327.72
Organism:
Homo sapiens (Human)
Description:
Q96GD4
Residue:
344
  
Inhibitor
Name:
BDBM50352308
Synonyms:
CHEMBL1822639
Type:
Small organic molecule
Emp. Form.:
C23H25FN8O2S
Mol. Mass.:
496.56
SMILES:
Cc1cc(Nc2nc(Sc3ccc(NC(=O)CN4C[C@H](F)C[C@H]4CO)cc3)nn3cccc23)n[nH]1
: