Target
Cystic fibrosis transmembrane conductance regulator
Ligand
BDBM50353340
Substrate
Meas. Tech.
ChEMBL_769084 (CHEMBL1832641)
IC50
350±n/a nM
Citation
 Snyder, DSTradtrantip, LYao, CKurth, MJVerkman, AS Potent, metabolically stable benzopyrimido-pyrrolo-oxazine-dione (BPO) CFTR inhibitors for polycystic kidney disease. J Med Chem 54:5468-77 (2011)  
Target
Name:
Cystic fibrosis transmembrane conductance regulator
Synonyms:
ABCC7 CFTR Channel conductance-controlling ATPase | cAMP-dependent chloride channel
Type:
Enzyme Catalytic Domain
Mol. Mass.:
168171.30
Organism:
Homo sapiens (Human)
Description:
gi_90421313
Residue:
1480
  
Inhibitor
Name:
BDBM50353340
Synonyms:
CHEMBL1831060
Type:
Small organic molecule
Emp. Form.:
C26H19F3N4O3
Mol. Mass.:
492.4493
SMILES:
Cn1c2c3C(Nc4ccccc4-n3c(-c3ccccc3)c2c(=O)n(C)c1=O)c1ccc(o1)C(F)(F)F
: