Target
Serine/threonine-protein kinase Chk1
Ligand
BDBM50355557
Substrate
Meas. Tech.
ChEMBL_776689 (CHEMBL1913786)
IC50
>100000±n/a nM
Citation
 Andreani, AGranaiola, MLeoni, ALocatelli, AMorigi, RRambaldi, MVaroli, LLannigan, DSmith, JScudiero, DKondapaka, SShoemaker, RH Imidazo[2,1-b]thiazole guanylhydrazones as RSK2 inhibitors. Eur J Med Chem 46:4311-23 (2011)  
Target
Name:
Serine/threonine-protein kinase Chk1
Synonyms:
CHEK1 CHK1 checkpoint homolog Checkpoint kinase-1 (CHK1)
Type:
Enzyme Catalytic Domain
Mol. Mass.:
54443.02
Organism:
Homo sapiens (Human)
Description:
gi_166295192
Residue:
476
  
Inhibitor
Name:
BDBM50355557
Synonyms:
CHEMBL1910625
Type:
Small organic molecule
Emp. Form.:
C13H10ClN7O2S
Mol. Mass.:
363.782
SMILES:
NC(=N)N\N=C\c1c(nc2sc(Cl)cn12)-c1ccc(cc1)[N+]([O-])=O
: