Target
Serine/threonine-protein kinase Chk2
Ligand
BDBM50355598
Substrate
Meas. Tech.
ChEMBL_776643 (CHEMBL1913740)
IC50
>100000±n/a nM
Citation
 Andreani, AGranaiola, MLeoni, ALocatelli, AMorigi, RRambaldi, MVaroli, LLannigan, DSmith, JScudiero, DKondapaka, SShoemaker, RH Imidazo[2,1-b]thiazole guanylhydrazones as RSK2 inhibitors. Eur J Med Chem 46:4311-23 (2011)  
Target
Name:
Serine/threonine-protein kinase Chk2
Synonyms:
CDS1 CHK2 Checkpoint Kinase (Chk2) Serine/threonine-protein kinase Chek2 | Serine/threonine-protein kinase Chk1/2
Type:
Protein
Mol. Mass.:
60908.59
Organism:
Homo sapiens (Human)
Description:
O96017
Residue:
543
  
Inhibitor
Name:
BDBM50355598
Synonyms:
CHEMBL1910752
Type:
Small organic molecule
Emp. Form.:
C13H11N7O2S
Mol. Mass.:
329.337
SMILES:
NC(=N)N\N=C\c1c(nc2sccn12)-c1cccc(c1)[N+]([O-])=O
: