Target
Sphingosine 1-phosphate receptor 1
Ligand
BDBM50357764
Substrate
Meas. Tech.
ChEMBL_786289 (CHEMBL1920394)
EC50
1.1±n/a nM
Citation
 Buzard, DHan, SThoresen, LMoody, JLopez, LKawasaki, ASchrader, TSage, CGao, YEdwards, JBarden, JThatte, JFu, LSolomon, MLiu, LAl-Shamma, HGatlin, JLe, MXing, CEspinola, SJones, RM Discovery and characterization of potent and selective 4-oxo-4-(5-(5-phenyl-1,2,4-oxadiazol-3-yl)indolin-1-yl)butanoic acids as S1P¿? agonists. Bioorg Med Chem Lett 21:6013-8 (2011)  
Target
Name:
Sphingosine 1-phosphate receptor 1
Synonyms:
Edg1 S1PR1_MOUSE Sphingosine 1-phosphate receptor 1 | Sphingosine 1-phosphate receptor 1 (S1P1)
Type:
Enzyme
Mol. Mass.:
42663.66
Organism:
Mus musculus (Mouse)
Description:
O08530
Residue:
382
  
Inhibitor
Name:
BDBM50357764
Synonyms:
CHEMBL1916399
Type:
Small organic molecule
Emp. Form.:
C22H15F3N4O5
Mol. Mass.:
472.3735
SMILES:
OC(=O)CCC(=O)N1CCc2cc(ccc12)-c1noc(n1)-c1cc(OC(F)(F)F)cc(c1)C#N
: