Target
cAMP and cAMP-inhibited cGMP 3',5'-cyclic phosphodiesterase 10A
Ligand
BDBM50357854
Substrate
Meas. Tech.
ChEMBL_787236 (CHEMBL1918958)
IC50
0.550000±n/a nM
Citation
 Malamas, MSNi, YErdei, JStange, HSchindler, RLankau, HJGrunwald, CFan, KYParris, KLangen, BEgerland, UHage, TMarquis, KLGrauer, SBrennan, JNavarra, RGraf, RHarrison, BLRobichaud, AKronbach, TPangalos, MNHoefgen, NBrandon, NJ Highly potent, selective, and orally active phosphodiesterase 10A inhibitors. J Med Chem 54:7621-38 (2011)  
Target
Name:
cAMP and cAMP-inhibited cGMP 3',5'-cyclic phosphodiesterase 10A
Synonyms:
3',5'-cyclic phosphodiesterase PDE10_HUMAN Phosphodiesterase 10A
Type:
Protein
Mol. Mass.:
88412.52
Organism:
Homo sapiens (Human)
Description:
Q9Y233
Residue:
779
  
Inhibitor
Name:
BDBM50357854
Synonyms:
CHEMBL1916114
Type:
Small organic molecule
Emp. Form.:
C19H17FN4O
Mol. Mass.:
336.3629
SMILES:
COc1cc(F)cc2c1nc(C)c1c(C)nc(-c3cccnc3C)n21
: