Target
Endothelin receptor type B
Ligand
BDBM50071431
Substrate
Meas. Tech.
ChEBML_63860
Ki
36±n/a nM
Citation
 Fruh, TSaika, HSvensson, LPitterna, TSakaki, JOkada, TUrade, YOda, KFujitani, YTakimoto, MYamamura, TInui, TMakatani, MUmemura, ITeno, NToh, HHayakawa, KMurata, T IRL 2500: A potent ETB selective endothelin antagonist Bioorg Med Chem Lett 6:2323-2328 (1996)    Article 
Target
Name:
Endothelin receptor type B
Synonyms:
EDNRB Endothelin receptor ET-B
Type:
PROTEIN
Mol. Mass.:
49616.89
Organism:
Sus scrofa
Description:
ChEMBL_63872
Residue:
443
  
Inhibitor
Name:
BDBM50071431
Synonyms:
(S)-2-{(R)-2-[(3,5-Dimethyl-benzoyl)-methyl-amino]-3-phenyl-propionylamino}-3-(1H-indol-3-yl)-propionic acid | CHEMBL439759
Type:
Small organic molecule
Emp. Form.:
C30H31N3O4
Mol. Mass.:
497.5848
SMILES:
CN([C@H](Cc1ccccc1)C(=O)N[C@@H](Cc1c[nH]c2ccccc12)C(O)=O)C(=O)c1cc(C)cc(C)c1
: