Target
Progesterone receptor
Ligand
BDBM50105559
Substrate
Meas. Tech.
ChEMBL_44525 (CHEMBL656175)
IC50
3061±n/a nM
Citation
 Zhang, PTerefenko, EAWrobel, JZhang, ZZhu, YCohen, JMarschke, KBMais, D Synthesis and progesterone receptor antagonist activities of 6-aryl benzimidazolones and benzothiazolones. Bioorg Med Chem Lett 11:2747-50 (2001)  
Target
Name:
Progesterone receptor
Synonyms:
NR3C3 PGR PRGR_HUMAN | progesterone
Type:
Protein
Mol. Mass.:
98979.52
Organism:
Homo sapiens (Human)
Description:
P06401
Residue:
933
  
Inhibitor
Name:
BDBM50105559
Synonyms:
1-Benzyl-5-(3-chloro-phenyl)-1,3-dihydro-benzoimidazol-2-one | CHEMBL94162
Type:
Small organic molecule
Emp. Form.:
C20H15ClN2O
Mol. Mass.:
334.799
SMILES:
Clc1cccc(c1)-c1ccc2n(Cc3ccccc3)c(=O)[nH]c2c1
: