Target
Gastrin/cholecystokinin type B receptor
Ligand
BDBM50019221
Substrate
Meas. Tech.
ChEBML_75463
IC50
80000±n/a nM
Citation
 Evans, BERittle, KEBock, MGDiPardo, RMFreidinger, RMWhitter, WLLundell, GFVeber, DFAnderson, PSChang, RS Methods for drug discovery: development of potent, selective, orally effective cholecystokinin antagonists. J Med Chem 31:2235-46 (1989)  
Target
Name:
Gastrin/cholecystokinin type B receptor
Synonyms:
CCK-2 receptor CCK-BR CCKRB Cholecystokinin receptor GASR_HUMAN | Gastrin/cholecystokinin type B receptor
Type:
G Protein-Coupled Receptor (GPCR)
Mol. Mass.:
48445.79
Organism:
Homo sapiens (Human)
Description:
Stable expression of human CCK-2 receptors in HEK 293 cells.
Residue:
447
  
Inhibitor
Name:
BDBM50019221
Synonyms:
CHEMBL308756 | N-(2-Oxo-5-phenyl-2,3-dihydro-1H-benzo[e][1,4]diazepin-3-yl)-4-propyl-benzamide
Type:
Small organic molecule
Emp. Form.:
C25H23N3O2
Mol. Mass.:
397.469
SMILES:
CCCc1ccc(cc1)C(=O)NC1N=C(c2ccccc2)c2ccccc2NC1=O
: