Target
Aromatase
Ligand
BDBM50368172
Substrate
Meas. Tech.
ChEMBL_50699 (CHEMBL663244)
IC50
18±n/a nM
Citation
 Browne, LJGude, CRodriguez, HSteele, REBhatnager, A Fadrozole hydrochloride: a potent, selective, nonsteroidal inhibitor of aromatase for the treatment of estrogen-dependent disease. J Med Chem 34:725-36 (1991)  
Target
Name:
Aromatase
Synonyms:
ARO1 CP19A_HUMAN CYP19 CYPXIX Cytochrome P450 19A1 Cytochrome P450-C19 (CYP19) FL cytokine receptor precursor | P-450AROM
Type:
Enzyme
Mol. Mass.:
57888.92
Organism:
Homo sapiens (Human)
Description:
P11511
Residue:
503
  
Inhibitor
Name:
BDBM50368172
Synonyms:
CHEMBL1203757
Type:
Small organic molecule
Emp. Form.:
C14H16N2
Mol. Mass.:
212.2902
SMILES:
Cc1ccc(cc1)C1CCCc2cncn12
: