Target
Prostaglandin-H2 D-isomerase
Ligand
BDBM85511
Substrate
Meas. Tech.
ChEBML_158157
IC50
230±n/a nM
Citation
 Bell, MRD'Ambra, TEKumar, VEissenstat, MAHerrmann, JLWetzel, JRRosi, DPhilion, REDaum, SJHlasta, DJ Antinociceptive (aminoalkyl)indoles. J Med Chem 34:1099-110 (1991)  
Target
Name:
Prostaglandin-H2 D-isomerase
Synonyms:
PTGDS_MOUSE | Ptgds
Type:
PROTEIN
Mol. Mass.:
21069.88
Organism:
Mus musculus
Description:
ChEMBL_158158
Residue:
189
  
Inhibitor
Name:
BDBM85511
Synonyms:
CAS_74103-07-4 Ketorolac tris salt | Toradol
Type:
Small organic molecule
Emp. Form.:
C15H13NO3
Mol. Mass.:
255.2686
SMILES:
OC(=O)C1CCn2c1ccc2C(=O)c1ccccc1
: