Target
Aminopeptidase N
Ligand
BDBM50002033
Substrate
Meas. Tech.
ChEBML_35491
IC50
80000±n/a nM
Citation
 Fournié-Zaluski, MCCoric, PTurcaud, SBruetschy, LLucas, ENoble, FRoques, BP Potent and systemically active aminopeptidase N inhibitors designed from active-site investigation. J Med Chem 35:1259-66 (1992)  
Target
Name:
Aminopeptidase N
Synonyms:
AMPN_PIG AP-M Alanyl aminopeptidase Aminopeptidase N (APN) Microsomal aminopeptidase pAPN
Type:
Protein
Mol. Mass.:
108810.25
Organism:
Sus scrofa (Pig)
Description:
P15145
Residue:
963
  
Inhibitor
Name:
BDBM50002033
Synonyms:
1-Benzylsulfanylmethyl-2-phenyl-ethyl-ammonium
Type:
Small organic molecule
Emp. Form.:
C16H20NS
Mol. Mass.:
258.401
SMILES:
[NH3+]C(CSCc1ccccc1)Cc1ccccc1
: