Target
Muscarinic acetylcholine receptor M2
Ligand
BDBM39341
Substrate
Meas. Tech.
ChEMBL_98750 (CHEMBL704479)
Ki
267±n/a nM
Citation
 McPherson, DWDeHaven-Hudkins, DLCallahan, APKnapp, FF Synthesis and biodistribution of iodine-125-labeled 1-azabicyclo[2.2.2]oct-3-yl alpha-hydroxy-alpha-(1-iodo-1-propen-3-yl)-alpha-phenylacetate. A new ligand for the potential imaging of muscarinic receptors by single photon emission computed tomography. J Med Chem 36:848-54 (1993)  
Target
Name:
Muscarinic acetylcholine receptor M2
Synonyms:
ACM2_RAT Chrm-2 | Chrm2
Type:
Enzyme Catalytic Domain
Mol. Mass.:
51555.53
Organism:
RAT
Description:
P10980
Residue:
466
  
Inhibitor
Name:
BDBM39341
Synonyms:
11-[(4-methylpiperazin-1-yl)acetyl]-5,11-dihydro-6H-pyrido[2,3-b][1,4]benzodiazepin-6-one 11-[2-(4-methylpiperazin-1-yl)acetyl]-5H-pyrido[2,3-b][1,4]benzodiazepin-6-one;hydrochloride 11-[2-(4-methylpiperazino)acetyl]-5H-pyrido[2,3-b][1,4]benzodiazepin-6-one;hydrochloride MLS000069702 PIRENZEPINE DIHYDROCHLORIDE cid_185248
Type:
Small organic molecule
Emp. Form.:
C19H21N5O2
Mol. Mass.:
351.4023
SMILES:
CN1CCN(CC(=O)N2c3ccccc3C(=O)Nc3cccnc23)CC1
: