Target
Sodium-dependent dopamine transporter
Ligand
BDBM50005534
Substrate
Meas. Tech.
ChEMBL_61836 (CHEMBL673206)
IC50
0.66±n/a nM
Citation
 He, XSRaymon, LPMattson, MVEldefrawi, MEde Costa, BR Synthesis and biological evaluation of 1-[1-(2-benzo[b]thienyl)cyclohexyl]piperidine homologues at dopamine-uptake and phencyclidine- and sigma-binding sites. J Med Chem 36:1188-93 (1993)  
Target
Name:
Sodium-dependent dopamine transporter
Synonyms:
DA transporter SC6A3_RAT Sodium-dependent dopamine transporter | Sodium-dependent dopamine transporter (DAT)
Type:
Multi-pass membrane protein
Mol. Mass.:
68749.45
Organism:
Rattus norvegicus (rat)
Description:
P23977
Residue:
619
  
Inhibitor
Name:
BDBM50005534
Synonyms:
1-(1-(benzo[b]thiophen-2-yl)cyclohexyl)piperidine 1-(1-Benzo[b]thiophen-2-yl-cyclohexyl)-piperidine(BTCP) 3-[(3-Chloro-phenyl)-phenyl-methoxy]-8-methyl-8-aza-bicyclo[3.2.1]octane | CHEMBL279556
Type:
Small organic molecule
Emp. Form.:
C19H25NS
Mol. Mass.:
299.474
SMILES:
C1CCN(CC1)C1(CCCCC1)c1cc2ccccc2s1
: