Target
Proteinase-activated receptor 1
Ligand
BDBM50054871
Substrate
Meas. Tech.
ChEMBL_209243 (CHEMBL814870)
EC50
35000±n/a nM
Citation
 Bernatowicz, MSKlimas, CEHartl, KSPeluso, MAllegretto, NJSeiler, SM Development of potent thrombin receptor antagonist peptides. J Med Chem 39:4879-87 (1997)  
Target
Name:
Proteinase-activated receptor 1
Synonyms:
CF2R F2R PAR1 Proteinase activated receptor 1 TR Thrombin receptor/ Proteinase-activated receptor 1(Par-1)
Type:
Protein
Mol. Mass.:
47450.07
Organism:
Homo sapiens (Human)
Description:
P25116
Residue:
425
  
Inhibitor
Name:
BDBM50054871
Synonyms:
2-[2-[2-{Acetyl-[(E)-(3-phenyl-acryloyl)]-amino}-3-(4-fluoro-phenyl)-propionylamino]-3-(3H-imidazol-4-yl)-propionylamino]-4-methyl-pentanoic acid (1-carbamoyl-4-guanidino-butyl)-amide | CHEMBL144883
Type:
Small organic molecule
Emp. Form.:
C38H49FN10O6
Mol. Mass.:
760.8575
SMILES:
CC(C)CC(NC(=O)C(Cc1cnc[nH]1)NC(=O)C(Cc1ccc(F)cc1)N(C(C)=O)C(=O)C=Cc1ccccc1)C(=O)NC(CCCNC(N)=N)C(N)=O
: