Target
Lysosomal Pro-X carboxypeptidase
Ligand
BDBM94507
Substrate
Meas. Tech.
ChEMBL_154088 (CHEMBL760612)
IC50
32±n/a nM
Citation
 Moriarty, RMEnache, LAZhao, LGilardi, RMattson, MVPrakash, O Rigid phencyclidine analogues. Binding to the phencyclidine and sigma 1 receptors. J Med Chem 41:468-77 (1998)  
Target
Name:
Lysosomal Pro-X carboxypeptidase
Synonyms:
Angiotensinase C PCP PRCP Prolylcarboxypeptidase | Prolylcarboxypeptidase (PRCP)
Type:
Enzyme
Mol. Mass.:
55805.19
Organism:
Homo sapiens (Human)
Description:
P42785
Residue:
496
  
Inhibitor
Name:
BDBM94507
Synonyms:
2-[2-(diethylamino)ethoxy]ethyl 1-phenylcyclopentane-1-carboxylate;2-hydroxypropane-1,2,3-tricarboxylic acid 2-hydroxypropane-1,2,3-tricarboxylic acid;1-phenyl-1-cyclopentanecarboxylic acid 2-[2-(diethylamino)ethoxy]ethyl ester CHEMBL73234 MLS002222257 cid_90010 | citric acid;1-phenylcyclopentanecarboxylic acid 2-[2-(diethylamino)ethoxy]ethyl ester
Type:
Small organic molecule
Emp. Form.:
C20H31NO3
Mol. Mass.:
333.465
SMILES:
CCN(CC)CCOCCOC(=O)C1(CCCC1)c1ccccc1
: