Target
Acetylcholinesterase
Ligand
BDBM10592
Substrate
Meas. Tech.
ChEMBL_27809 (CHEMBL636699)
IC50
3.03±n/a nM
Citation
 Camps, PEl Achab R, naMorral, JMuñoz-Torrero, DBadia, ABaños, JEVivas, NMBarril, XOrozco, MLuque, FJ New tacrine-huperzine A hybrids (huprines): highly potent tight-binding acetylcholinesterase inhibitors of interest for the treatment of Alzheimer's disease. J Med Chem 43:4657-66 (2001)  
Target
Name:
Acetylcholinesterase
Synonyms:
ACES_BOVIN Acetylcholinesterase (AChE) | Acetylcholinesterase precursor
Type:
Enzyme
Mol. Mass.:
67659.62
Organism:
Bos taurus (bovine)
Description:
Residue:
613
  
Inhibitor
Name:
BDBM10592
Synonyms:
7-chloro-15-methyl-10-azatetracyclo[11.3.1.0^{2,11}.0^{4,9}]heptadeca-2,4(9),5,7,10,14-hexaen-3-amine Huprine Y.HCl | US9238626, (+/-)-Huprine Y HCl
Type:
Small organic molecule
Emp. Form.:
C17H17ClN2
Mol. Mass.:
284.783
SMILES:
CC1=CC2CC(C1)c1c(C2)nc2cc(Cl)ccc2c1N
: