Target
Aminopeptidase N
Ligand
BDBM50087094
Substrate
Meas. Tech.
ChEMBL_28885 (CHEMBL646583)
Ki
2.3±n/a nM
Citation
 Chen, HNoble, FMothé, AMeudal, HCoric, PDanascimento, SRoques, BPGeorge, PFournié-Zaluski, MC Phosphinic derivatives as new dual enkephalin-degrading enzyme inhibitors: synthesis, biological properties, and antinociceptive activities. J Med Chem 43:1398-408 (2001)  
Target
Name:
Aminopeptidase N
Synonyms:
AMPN_PIG AP-M Alanyl aminopeptidase Aminopeptidase N (APN) Microsomal aminopeptidase pAPN
Type:
Protein
Mol. Mass.:
108810.25
Organism:
Sus scrofa (Pig)
Description:
P15145
Residue:
963
  
Inhibitor
Name:
BDBM50087094
Synonyms:
(R,S,S)1-{[2-(1-Carboxy-2-phenyl-ethylcarbamoyl)-4-methyl-pentyl]-hydroxy-phosphinoyl}-2-phenyl-ethyl-ammonium
Type:
Small organic molecule
Emp. Form.:
C24H34N2O5P
Mol. Mass.:
461.5104
SMILES:
CC(C)C[C@H](CP(O)(=O)[C@H]([NH3+])Cc1ccccc1)C(=O)N[C@@H](Cc1ccccc1)C(O)=O
: