Target
P2Y purinoceptor 1
Ligand
BDBM50112765
Substrate
Meas. Tech.
ChEMBL_162517 (CHEMBL766763)
EC50
14±n/a nM
Citation
 Ravi, RGKim, HSServos, JZimmermann, HLee, KMaddileti, SBoyer, JLHarden, TKJacobson, KA Adenine nucleotide analogues locked in a Northern methanocarba conformation: enhanced stability and potency as P2Y(1) receptor agonists. J Med Chem 45:2090-100 (2002)  
Target
Name:
P2Y purinoceptor 1
Synonyms:
ATP receptor P2RY1_HUMAN P2Y1 Purinergic receptor P2Y1
Type:
Enzyme
Mol. Mass.:
42090.25
Organism:
Homo sapiens (Human)
Description:
P47900
Residue:
373
  
Inhibitor
Name:
BDBM50112765
Synonyms:
CHEMBL302077 | triPhosphoric acid-[4-(6-amino-purin-9-yl)-2,3-dihydroxy-bicyclo[3.1.0]hex-1-ylmethyl] ester
Type:
Small organic molecule
Emp. Form.:
C12H18N5O12P3
Mol. Mass.:
517.2189
SMILES:
Nc1ncnc2n(cnc12)C1C2CC2(COP(O)(=O)OP(O)(=O)OP(O)(O)=O)C(O)C1O
: