Target
Glutamate receptor ionotropic, kainate 2
Ligand
BDBM86751
Substrate
Meas. Tech.
ChEMBL_90593 (CHEMBL701338)
Ki
>100000±n/a nM
Citation
 Filla, SAWinter, MAJohnson, KWBleakman, DBell, MGBleisch, TJCastaño, AMClemens-Smith, Adel Prado, MDieckman, DKDominguez, EEscribano, AHo, KHHudziak, KJKatofiasc, MAMartinez-Perez, JAMateo, AMathes, BMMattiuz, ELOgden, AMPhebus, LAStack, DRStratford, REOrnstein, PL Ethyl (3S,4aR,6S,8aR)-6-(4-ethoxycar- bonylimidazol-1-ylmethyl)decahydroiso-quinoline-3-carboxylic ester: a prodrug of a GluR5 kainate receptor antagonist active in two animal models of acute migraine. J Med Chem 45:4383-6 (2002)  
Target
Name:
Glutamate receptor ionotropic, kainate 2
Synonyms:
EAA4 GLUR6 GRIK2_HUMAN GluR-6 Glutamate receptor 6 Glutamate receptor, ionotropic kainate 2 Glutamate-Kainate, GluR6
Type:
Enzyme Catalytic Domain
Mol. Mass.:
102592.78
Organism:
Homo sapiens (Human)
Description:
Q13002
Residue:
908
  
Inhibitor
Name:
BDBM86751
Synonyms:
CHEMBL14935 LY-293558
Type:
Small organic molecule
Emp. Form.:
C13H21N5O2
Mol. Mass.:
279.3381
SMILES:
OC(=O)[C@@H]1C[C@H]2C[C@@H](CCc3nnn[nH]3)CC[C@H]2CN1
: