Target
Sodium-dependent serotonin transporter
Ligand
BDBM50160892
Substrate
Meas. Tech.
ChEMBL_303219 (CHEMBL827185)
Ki
0.11±n/a nM
Citation
 Tamagnan, GAlagille, DFu, XKula, NSBaldessarini, RJInnis, RBBaldwin, RM Synthesis and monoamine transporter affinity of new 2beta-carbomethoxy-3beta-[4-(substituted thiophenyl)]phenyltropanes: discovery of a selective SERT antagonist with picomolar potency. Bioorg Med Chem Lett 15:1131-3 (2005)  
Target
Name:
Sodium-dependent serotonin transporter
Synonyms:
5-HT Transporter 5HT transporter Anandamid membrane transporter, AMT Monoamine transporters; Norepinephrine & serotonin Slc6a4 Sodium-dependent serotonin transporter (SERT) | imipramine receptor
Type:
Multi-pass membrane protein
Mol. Mass.:
70168.43
Organism:
Rattus norvegicus (rat)
Description:
P31652
Residue:
630
  
Inhibitor
Name:
BDBM50160892
Synonyms:
3-(4-Thiophen-2-yl-phenyl)-8-aza-bicyclo[3.2.1]octane-2-carboxylic acid methyl ester | CHEMBL181557
Type:
Small organic molecule
Emp. Form.:
C19H21NO2S
Mol. Mass.:
327.441
SMILES:
COC(=O)C1C2CCC(CC1c1ccc(cc1)-c1cccs1)N2
: