Target
MAP kinase-activated protein kinase 2
Ligand
BDBM50169959
Substrate
Meas. Tech.
ChEMBL_305458 (CHEMBL877004)
IC50
>10000±n/a nM
Citation
 Gaillard, PJeanclaude-Etter, IArdissone, VArkinstall, SCambet, YCamps, MChabert, CChurch, DCirillo, RGretener, DHalazy, SNichols, ASzyndralewiez, CVitte, PAGotteland, JP Design and synthesis of the first generation of novel potent, selective, and in vivo active (benzothiazol-2-yl)acetonitrile inhibitors of the c-Jun N-terminal kinase. J Med Chem 48:4596-607 (2005)  
Target
Name:
MAP kinase-activated protein kinase 2
Synonyms:
MAP kinase-activated protein kinase 2 (MAPKAPK2) MAP kinase-activated protein kinase 2 (p38/MK2) MAPK-activated protein kinase 2 MAPKAP kinase 2 MAPKAPK2 | MK2
Type:
Serine/threonine-protein kinase
Mol. Mass.:
45579.87
Organism:
Homo sapiens (Human)
Description:
P49137
Residue:
400
  
Inhibitor
Name:
BDBM50169959
Synonyms:
2-(benzo[d]thiazol-2(3H)-ylidene)-2-(2-(2-(pyridin-3-yl)ethylamino)pyrimidin-4-yl)acetonitrile AS601245 CHEMBL191384 | [3H-Benzothiazol-(2Z)-ylidene]-[2-(2-pyridin-3-yl-ethylamino)-pyrimidin-4-yl]-acetonitrile
Type:
Small organic molecule
Emp. Form.:
C20H16N6S
Mol. Mass.:
372.446
SMILES:
N#CC(c1nc2ccccc2s1)c1ccnc(NCCc2cccnc2)n1
: