Target
Adenosine receptor A1
Ligand
BDBM50163564
Substrate
Meas. Tech.
ChEMBL_303280 (CHEMBL828273)
Ki
8.70±n/a nM
Citation
 Ilas, JPecar, SHockemeyer, JEuler, HKirfel, AMüller, CE Development of spin-labeled probes for adenosine receptors. J Med Chem 48:2108-14 (2005)  
Target
Name:
Adenosine receptor A1
Synonyms:
AA1R_RAT ADENOSINE A1 high Adenosine A1 receptor (A1) Adenosine receptors A1 | Adora1
Type:
Protein
Mol. Mass.:
36704.13
Organism:
Rattus norvegicus (rat)
Description:
Residue:
326
  
Inhibitor
Name:
BDBM50163564
Synonyms:
3-Benzyl-8-cyclopentyl-1-propyl-3,7-dihydro-purine-2,6-dione | CHEMBL362604
Type:
Small organic molecule
Emp. Form.:
C20H24N4O2
Mol. Mass.:
352.4302
SMILES:
CCCn1c(=O)n(Cc2ccccc2)c2nc([nH]c2c1=O)C1CCCC1
: