Target
Amine oxidase [flavin-containing] A
Ligand
BDBM50184849
Substrate
Meas. Tech.
ChEMBL_341313 (CHEMBL860926)
IC50
1300±n/a nM
Citation
 Wang, EYGao, HSalter-Cid, LZhang, JHuang, LPodar, EMMiller, AZhao, JO'rourke, ALinnik, MD Design, synthesis, and biological evaluation of semicarbazide-sensitive amine oxidase (SSAO) inhibitors with anti-inflammatory activity. J Med Chem 49:2166-73 (2006)  
Target
Name:
Amine oxidase [flavin-containing] A
Synonyms:
AOFA_HUMAN MAO-A Monoamine oxidase Monoamine oxidase type A (MAO A) Monoamine oxidase type A (MAOA)
Type:
Protein
Mol. Mass.:
59689.53
Organism:
Homo sapiens (Human)
Description:
P21397
Residue:
527
  
Inhibitor
Name:
BDBM50184849
Synonyms:
CHEMBL536057 | N'-(2-phenylallyl)hydrazine hydrochloride
Type:
Small organic molecule
Emp. Form.:
C9H12N2
Mol. Mass.:
148.205
SMILES:
NNCC(=C)c1ccccc1
: