Target
P2Y purinoceptor 2
Ligand
BDBM50205418
Substrate
Meas. Tech.
ChEMBL_428323 (CHEMBL917101)
EC50
1880±n/a nM
Citation
 Ivanov, AAKo, HCosyn, LMaddileti, SBesada, PFricks, ICostanzi, SHarden, TKCalenbergh, SVJacobson, KA Molecular modeling of the human P2Y2 receptor and design of a selective agonist, 2'-amino-2'-deoxy-2-thiouridine 5'-triphosphate. J Med Chem 50:1166-76 (2007)  
Target
Name:
P2Y purinoceptor 2
Synonyms:
ATP receptor P2RY2 P2U purinoceptor 1 P2Y purinoceptor 2 Purinergic receptor | Purinergic receptor P2Y2
Type:
PROTEIN
Mol. Mass.:
42299.21
Organism:
Homo sapiens (Human)
Description:
ChEMBL_1455361
Residue:
377
  
Inhibitor
Name:
BDBM50205418
Synonyms:
CHEMBL410594 | uridine 5'-tetraphosphate 5'-ribose
Type:
Small organic molecule
Emp. Form.:
C14H24N2O22P4
Mol. Mass.:
696.2356
SMILES:
OC1O[C@H](COP(O)(=O)OP(O)(=O)OP(O)(=O)OP(O)(=O)OC[C@H]2O[C@H]([C@H](O)[C@@H]2O)n2ccc(=O)[nH]c2=O)[C@@H](O)[C@H]1O
: