Target
Melanocortin receptor 5
Ligand
BDBM50158406
Substrate
Meas. Tech.
ChEMBL_430381 (CHEMBL915324)
EC50
0.18±n/a nM
Citation
 Joseph, CGWang, XSScott, JWBauzo, RMXiang, ZRichards, NGHaskell-Luevano, C Stereochemical studies of the monocyclic agouti-related protein (103-122) Arg-Phe-Phe residues: conversion of a melanocortin-4 receptor antagonist into an agonist and results in the discovery of a potent and selective melanocortin-1 agonist. J Med Chem 47:6702-10 (2004)  
Target
Name:
Melanocortin receptor 5
Synonyms:
MC5R_MOUSE Melanocortin receptor 5 | Melanocortin receptor 5 (MC5R)
Type:
Enzyme
Mol. Mass.:
36966.58
Organism:
Mus musculus (Mouse)
Description:
P41149
Residue:
325
  
Inhibitor
Name:
BDBM50158406
Synonyms:
Ac-Nle-c[Asp-His-DPhe-Arg-Trp-Lys]-NH2 | CHEMBL224277
Type:
Small organic molecule
Emp. Form.:
C53H73N15O11
Mol. Mass.:
1096.2406
SMILES:
CCCC[C@H](NC(C)=O)C(=O)N[C@H]1CC(=O)NCCCC[C@H](NC(=O)[C@H](Cc2c[nH]c3ccccc23)NC(=O)[C@H](CCCN=C(N)N)NC(=O)[C@@H](Cc2ccccc2)NC(=O)[C@H](Cc2cnc[nH]2)NC(=O)C1CC(O)=O)C(N)=O
: