Target
Estrogen receptor
Ligand
BDBM17292
Substrate
Meas. Tech.
ChEMBL_455545 (CHEMBL886324)
EC50
0.75±n/a nM
Citation
 Blizzard, TAGude, CChan, WBirzin, ETMojena, MTudela, CChen, FKnecht, KSu, QKraker, BHolmes, MARohrer, SPHammond, ML Bridged androstenediol analogs as ER-beta selective SERMs. Bioorg Med Chem Lett 17:2944-8 (2007)  
Target
Name:
Estrogen receptor
Synonyms:
ER ESR ESR1_HUMAN Estrogen receptor Estrogen receptor (ER-alpha) Estrogen receptor alpha (ER) Nuclear receptor subfamily 3 group A member 1
Type:
Protein
Mol. Mass.:
66230.44
Organism:
Homo sapiens (Human)
Description:
P03372
Residue:
595
  
Inhibitor
Name:
BDBM17292
Synonyms:
(1S,10R,11S,14S,15S)-15-methyltetracyclo[8.7.0.0^{2,7}.0^{11,15}]heptadeca-2,4,6-triene-5,14-diol 17α-ethinylestradiol CHEMBL135 ESTRADIOL Ovocyclin US9040509, E2 US9561238, E2 [2,4,6,7-3H]-E2 [3H]]estradiol
Type:
Steroid
Emp. Form.:
C18H24O2
Mol. Mass.:
272.382
SMILES:
[H][C@@]12CC[C@H](O)[C@@]1(C)CC[C@]1([H])c3ccc(O)cc3CC[C@@]21[H]
: