Target
Estrogen receptor beta
Ligand
BDBM50223231
Substrate
Meas. Tech.
ChEMBL_458135 (CHEMBL925468)
IC50
1760±n/a nM
Citation
 Blizzard, TAGude, CMorgan, JDChan, WBirzin, ETMojena, MTudela, CChen, FKnecht, KSu, QKraker, BMosley, RTHolmes, MARohrer, SPHammond, ML Androstene-3,5-dienes as ER-beta selective SERMs. Bioorg Med Chem Lett 17:6295-8 (2007)  
Target
Name:
Estrogen receptor beta
Synonyms:
ER-beta ESR2_HUMAN Estradiol receptor beta (ERβ) Estrogen receptor (ER beta) Estrogen receptor beta (ER beta) NR3A2 estrogen beta
Type:
Protein
Mol. Mass.:
59238.43
Organism:
Homo sapiens (Human)
Description:
Q92731
Residue:
530
  
Inhibitor
Name:
BDBM50223231
Synonyms:
(8R,9S,10S,13S,14S,17S)-13-methyl-3-phenyl-10-vinyl-2,7,8,9,10,11,12,13,14,15,16,17-dodecahydro-1H-cyclopenta[a]phenanthren-17-ol | CHEMBL398840
Type:
Small organic molecule
Emp. Form.:
C26H32O
Mol. Mass.:
360.5317
SMILES:
C[C@]12CC[C@H]3[C@@H](CC=C4C=C(CC[C@]34C=C)c3ccccc3)[C@@H]1CC[C@@H]2O
: