Target
Integrin alpha-V/beta-3
Ligand
BDBM50177887
Substrate
Meas. Tech.
ChEMBL_465288 (CHEMBL933853)
IC50
0.26±n/a nM
Citation
 Zanardi, FBurreddu, PRassu, GAuzzas, LBattistini, LCurti, CSartori, ANicastro, GMenchi, GCini, NBottoncetti, ABottonocetti, ARaspanti, SCasiraghi, G Discovery of subnanomolar arginine-glycine-aspartate-based alphaVbeta3/alphaVbeta5 integrin binders embedding 4-aminoproline residues. J Med Chem 51:1771-82 (2008)  
Target
Name:
Integrin alpha-V/beta-3
Synonyms:
ITGAV/ITGB3 | Integrin beta-3/Vitronectin receptor alpha
Type:
Enzyme
Mol. Mass.:
Description:
Components:
This complex has 2 components.
Component 1
Name:
Integrin alpha-V
Synonyms:
ITAV_HUMAN Integrin alpha-V/alpha-5 VNRA Vitronectin receptor | Vitronectin receptor subunit alpha
Type:
PROTEIN
Mol. Mass.:
116024.92
Organism:
Homo sapiens (Human)
Description:
ChEMBL_582336
Residue:
1048
  
Component 2
Name:
Integrin beta-3
Synonyms:
CD_antigen=CD61 GPIIIa ITGB3 Platelet membrane glycoprotein IIIa
Type:
Protein
Mol. Mass.:
87038.91
Organism:
Homo sapiens (Human)
Description:
P05106
Residue:
788
  
Inhibitor
Name:
BDBM50177887
Synonyms:
CHEMBL269913 c-[-Arg-Gly-Asp-Acpca32-]
Type:
Small organic molecule
Emp. Form.:
C18H29N7O6
Mol. Mass.:
439.4662
SMILES:
[#7]\[#6](-[#7])=[#7]\[#6]-[#6]-[#6]-[#6@@H]-1-[#7]-[#6](=O)-[#6@@H]-2-[#6]-[#6]-[#6@H](-[#6]-2)-[#7]-[#6](=O)-[#6@H](-[#6]-[#6](-[#8])=O)-[#7]-[#6](=O)-[#6]-[#7]-[#6]-1=O
: