Target
Collagenase 3
Ligand
BDBM50372657
Substrate
Meas. Tech.
ChEMBL_465538 (CHEMBL930771)
IC50
9.8±n/a nM
Citation
 Li, JJNahra, JJohnson, ARBunker, AO'Brien, PYue, WSOrtwine, DFMan, CFBaragi, VKilgore, KDyer, RDHan, HK Quinazolinones and pyrido[3,4-d]pyrimidin-4-ones as orally active and specific matrix metalloproteinase-13 inhibitors for the treatment of osteoarthritis. J Med Chem 51:835-41 (2008)  
Target
Name:
Collagenase 3
Synonyms:
MMP-13 MMP13_HUMAN Matrix metalloproteinase-13 (MMP-13) | Matrix metalloproteinase-13 (MMP13)
Type:
Enzyme
Mol. Mass.:
53808.06
Organism:
Homo sapiens (Human)
Description:
P45452
Residue:
471
  
Inhibitor
Name:
BDBM50372657
Synonyms:
CHEMBL273054
Type:
Small organic molecule
Emp. Form.:
C25H18N2O3
Mol. Mass.:
394.422
SMILES:
OC(=O)c1ccc(Cn2cnc3ccc(cc3c2=O)C#CCc2ccccc2)cc1
: