Target
Sodium-dependent noradrenaline transporter
Ligand
BDBM50032379
Substrate
Meas. Tech.
ChEMBL_467619 (CHEMBL930494)
IC50
77±n/a nM
Citation
 Tamiya, JDyck, BZhang, MPhan, KFleck, BAAparicio, AJovic, FTran, JAVickers, TGrey, JFoster, ACChen, C Identification of 1S,2R-milnacipran analogs as potent norepinephrine and serotonin transporter inhibitors. Bioorg Med Chem Lett 18:3328-32 (2008)  
Target
Name:
Sodium-dependent noradrenaline transporter
Synonyms:
Monoamine transporter NET Noradrenaline Transporter (NET) Norepinephrine transporter protein (NET) SLC6A2 Sodium-dependent noradrenaline transporter (NET) | Solute carrier family 6 member 2
Type:
Multi-pass membrane protein
Mol. Mass.:
69337.72
Organism:
Homo sapiens (Human)
Description:
P23975
Residue:
617
  
Inhibitor
Name:
BDBM50032379
Synonyms:
(1S,2R)-2-(aminomethyl)-N,N-diethyl-1-phenylcyclopropanecarboxamide CHEMBL99946 | LEVOMILNACIPRAN
Type:
Small organic molecule
Emp. Form.:
C15H22N2O
Mol. Mass.:
246.348
SMILES:
CCN(CC)C(=O)[C@]1(C[C@H]1CN)c1ccccc1
: