Target
Serine/threonine-protein kinase Chk1
Ligand
BDBM91872
Substrate
Meas. Tech.
ChEMBL_470513 (CHEMBL950057)
EC50
40±n/a nM
Citation
 Hasvold, LAWang, LPrzytulinska, MXiao, ZChen, ZGu, WZMerta, PJXue, JKovar, PZhang, HPark, CSowin, TJRosenberg, SHLin, NH Investigation of novel 7,8-disubstituted-5,10-dihydro-dibenzo[b,e][1,4]diazepin-11-ones as potent Chk1 inhibitors. Bioorg Med Chem Lett 18:2311-5 (2008)  
Target
Name:
Serine/threonine-protein kinase Chk1
Synonyms:
CHEK1 CHK1 checkpoint homolog Checkpoint kinase-1 (CHK1)
Type:
Enzyme Catalytic Domain
Mol. Mass.:
54443.02
Organism:
Homo sapiens (Human)
Description:
gi_166295192
Residue:
476
  
Inhibitor
Name:
BDBM91872
Synonyms:
Chk1_152
Type:
Emp. Form.:
C25H25N3O6
Mol. Mass.:
463.4825
SMILES:
COc1cc2NC(=O)c3ccc(cc3Nc2cc1CC(C)(C)O)-c1ccc(c(OC)c1)[N+]([O-])=O
: