Target
Purine nucleoside phosphorylase
Ligand
BDBM50293073
Substrate
Meas. Tech.
ChEMBL_519471 (CHEMBL951777)
Ki
5.20±n/a nM
Citation
 Clinch, KEvans, GBFröhlich, RFFurneaux, RHKelly, PMLegentil, LMurkin, ASLi, LSchramm, VLTyler, PCWoolhouse, AD Third-generation immucillins: syntheses and bioactivities of acyclic immucillin inhibitors of human purine nucleoside phosphorylase. J Med Chem 52:1126-43 (2009)  
Target
Name:
Purine nucleoside phosphorylase
Synonyms:
Inosine phosphorylase NP PNPH_HUMAN | Purine nucleoside phosphorylase (PNPase)
Type:
Enzyme
Mol. Mass.:
32119.53
Organism:
Homo sapiens (Human)
Description:
Residue:
289
  
Inhibitor
Name:
BDBM50293073
Synonyms:
7-({[(2S,3S)-1,3,4-Trihydroxybutan-2-yl]amino}methyl)-3,5-dihydro-4H-pyrrolo[3,2-d]pyrimidin-4-one | CHEMBL490285
Type:
Small organic molecule
Emp. Form.:
C11H16N4O4
Mol. Mass.:
268.2691
SMILES:
OC[C@@H](O)[C@H](CO)NCc1c[nH]c2c1nc[nH]c2=O
: