Target
Peroxisome proliferator-activated receptor alpha
Ligand
BDBM50256109
Substrate
Meas. Tech.
ChEMBL_519278 (CHEMBL947730)
EC50
72±n/a nM
Citation
 Pingali, HJain, MShah, SPatil, PMakadia, PZaware, PSairam, KVJamili, JGoel, APatel, MPatel, P Modulation of PPAR receptor subtype selectivity of the ligands: aliphatic chain vs aromatic ring as a spacer between pharmacophore and the lipophilic moiety. Bioorg Med Chem Lett 18:6471-5 (2008)  
Target
Name:
Peroxisome proliferator-activated receptor alpha
Synonyms:
NR1C1 PPAR PPAR-alpha PPARA_HUMAN Peroxisome proliferator-activated receptor | Peroxisome proliferator-activated receptor alpha (PPAR alpha)
Type:
Enzyme
Mol. Mass.:
52222.08
Organism:
Homo sapiens (Human)
Description:
Q07869
Residue:
468
  
Inhibitor
Name:
BDBM50256109
Synonyms:
(2s,5s)-2-methyl-5-(4-((5-methyl-2-p-tolyloxazol-4-yl)methoxy)benzyl)-1,3-dioxane-2-carboxylic acid CHEMBL481551
Type:
Small organic molecule
Emp. Form.:
C25H27NO6
Mol. Mass.:
437.485
SMILES:
Cc1oc(nc1COc1ccc(C[C@H]2CO[C@](C)(OC2)C(O)=O)cc1)-c1ccc(C)cc1
: